Domain 404-error.de kaufen?
Wir ziehen mit dem Projekt
404-error.de um.
Sind Sie am Kauf der Domain
404-error.de interessiert?
domain@kv-gmbh.de · 0541-91531010
Domain 404-error.de kaufen?
Was bedeutet die Fehlermeldung "Error 404 - Seite nicht gefunden" und wie kann ich sie beheben?
Die Fehlermeldung "Error 404 - Seite nicht gefunden" bedeutet, dass der Server die angeforderte Seite nicht finden kann. Dies kann auf eine falsche URL, gelöschte Seite oder fehlerhafte Verlinkung zurückzuführen sein. Um den Fehler zu beheben, überprüfe die URL, aktualisiere die Verlinkungen und sorge dafür, dass die Seite korrekt hochgeladen ist. **
Was bedeutet die Fehlermeldung "Error 404 - Seite nicht gefunden" und wie kann ich das Problem lösen?
Die Fehlermeldung "Error 404 - Seite nicht gefunden" bedeutet, dass der Server die angeforderte Seite nicht finden kann. Dies kann auf eine falsche URL, gelöschte Seite oder Serverprobleme zurückzuführen sein. Um das Problem zu lösen, überprüfen Sie die URL auf Tippfehler, aktualisieren Sie die Seite oder kontaktieren Sie den Website-Betreiber, um zu überprüfen, ob die Seite noch existiert. **
Ähnliche Suchbegriffe für 3M-FT-30-Fit-Test
Top-Angebote
Produkte zum Begriff 3M-FT-30-Fit-Test:
-
3M FT-10 Fit Test Dichtsitz-Prüfkit Fit Test Apparat (süss)Bei dem 3M Fit Test FT10 handelt es sich um ein Kontrollzubehör für 3M Halbmasken, mit dem sich anhand eines Geschmackstests der Dichtsitz partikelfiltrierender Halbmasken und von Halbmasken mit Parti...277,76 €*Versand: 0,00 €Sichere Weiterleitung zum Anbieter
-
3M FT-14 Fit Test Prüfhaube, Pack = 10StückDie Prüfhaube FT-14 wird verwendet, um den Dichtsitz am Gesicht bei Partikelatemschutz oder Gas-/Dämpfeatemschutz mit einem Partikel-Vorfilter zu überprüfen. Für die Verwendung mit dem 3M Apparat zu...345,59 €*Versand: 0,00 €Sichere Weiterleitung zum Anbieter
-
3M FT-12 Fit Test Lösung, Nachfüllflaschen a 55ml, Süss (Pack=6Stück)Bei der 3M Fit Test Lösung FT12 handelt es sich um ein Masken- und Kontrollzubehör von 3M. Die Fit Test Lösung in der Nachfüllflasche wird für den 3M Fit Test FT10 zur qualitativen Dichtsitzprüfung fü...188,17 €*Versand: 0,00 €Sichere Weiterleitung zum Anbieter
-
3M FT-32 Fit Test Lösung, Nachfüllflaschen a 55ml, bitter (Pack=6Stück)Bei der 3M Sensitivity Test Lösung FT32 handelt es sich um ein Masken- und Kontrollzubehör von 3M. Die Sensitivity Test Lösung in der Nachfüllflasche wird für den 3M Fit Test FT30 zur qualitativen Dic...188,17 €*Versand: 0,00 €Sichere Weiterleitung zum Anbieter
-
Was bedeutet die Fehlermeldung "CSS-Datei nicht gefunden 404"?
Die Fehlermeldung "CSS-Datei nicht gefunden 404" bedeutet, dass der Webbrowser die angeforderte CSS-Datei nicht auf dem Server finden kann. Dies kann verschiedene Gründe haben, wie zum Beispiel einen falschen Dateipfad oder eine gelöschte oder verschobene Datei. Die CSS-Datei ist wichtig für das Styling und das Aussehen einer Webseite, daher kann das Fehlen dieser Datei zu einer fehlerhaften Darstellung der Webseite führen. **
-
Was bedeutet die Fehlermeldung 'fatal error: stddef.h: Datei oder Verzeichnis nicht gefunden'?
Die Fehlermeldung 'fatal error: stddef.h: Datei oder Verzeichnis nicht gefunden' bedeutet, dass der Compiler die Header-Datei stddef.h nicht finden kann. Diese Datei ist Teil der Standardbibliothek und wird normalerweise benötigt, um grundlegende Datentypen und Funktionen zu definieren. Möglicherweise ist die Datei nicht im richtigen Verzeichnis oder es gibt ein Problem mit den Pfaden in den Compiler-Einstellungen. Es ist wichtig, sicherzustellen, dass die Datei vorhanden ist und korrekt referenziert wird, um diesen Fehler zu beheben. **
-
Was bedeutet die Fehlermeldung "Fatal error: Uncaught PDOException: SQLSTATE[42S22]: Spalte nicht gefunden: 1054 Unbekannte Spalte 'test' im 'where'-Klausel in C:\xampp\htdocs\shop\meinangemeldet.php?".
Die Fehlermeldung "Fatal error: Uncaught PDOException: SQLSTATE[42S22]: Spalte nicht gefunden: 1054 Unbekannte Spalte 'test' im 'where'-Klausel in C:\xampp\htdocs\shop\meinangemeldet.php" bedeutet, dass in der SQL-Abfrage eine Spalte namens 'test' verwendet wird, die in der Datenbanktabelle nicht existiert. Dadurch kann die Abfrage nicht ausgeführt werden, da die angegebene Spalte nicht gefunden werden kann. Möglicherweise wurde ein Tippfehler gemacht oder die Spalte wurde umbenannt oder gelöscht. Es ist wichtig, die SQL-Abfrage zu überprüfen und sicherzustellen, dass alle Spalten korrekt benannt sind und in der Datenbank vorhanden sind. **
-
Wie viel Erde befindet sich in einem Loch mit den Maßen 3m x 3m x 3m?
In einem Loch mit den Maßen 3m x 3m x 3m befindet sich keine Erde, da es sich um ein Loch handelt, das ausgegraben wurde und somit die Erde entfernt wurde. **
Warum erscheint die Fehlermeldung "404 Not Found"?
Die Fehlermeldung "404 Not Found" erscheint, wenn der Server keine Ressource unter der angegebenen URL finden kann. Dies kann verschiedene Gründe haben, wie zum Beispiel eine falsch geschriebene URL, eine gelöschte oder verschobene Datei oder ein Problem mit den Servereinstellungen. In jedem Fall bedeutet die Fehlermeldung, dass die angeforderte Seite nicht verfügbar ist. **
Was bedeutet die Fehlermeldung "Error 1275"?
Die Fehlermeldung "Error 1275" deutet in der Regel darauf hin, dass ein Programm oder eine Anwendung nicht mit Administratorrechten ausgeführt wird. Um den Fehler zu beheben, sollte das Programm mit Administratorrechten gestartet werden. **
Top-Angebote
Produkte zum Begriff 3M-FT-30-Fit-Test:
-
3M FT-30 Fit Test Dichtsitz-Prüfkit Fit Test Apparat (bitter)Bei dem 3M Fit Test FT30 handelt es sich um ein Kontrollzubehör für 3M Halbmasken, mit dem sich anhand eines Geschmackstests der Dichtsitz partikelfiltrierender Halbmasken und von Halbmasken mit Parti...277,76 €*Versand: 0,00 €Sichere Weiterleitung zum Anbieter
-
3M FT-10 Fit Test Dichtsitz-Prüfkit Fit Test Apparat (süss)Bei dem 3M Fit Test FT10 handelt es sich um ein Kontrollzubehör für 3M Halbmasken, mit dem sich anhand eines Geschmackstests der Dichtsitz partikelfiltrierender Halbmasken und von Halbmasken mit Parti...277,76 €*Versand: 0,00 €Sichere Weiterleitung zum Anbieter
-
3M FT-14 Fit Test Prüfhaube, Pack = 10StückDie Prüfhaube FT-14 wird verwendet, um den Dichtsitz am Gesicht bei Partikelatemschutz oder Gas-/Dämpfeatemschutz mit einem Partikel-Vorfilter zu überprüfen. Für die Verwendung mit dem 3M Apparat zu...345,59 €*Versand: 0,00 €Sichere Weiterleitung zum Anbieter
-
Was bedeutet die Fehlermeldung "Error 404 - Seite nicht gefunden" und wie kann ich sie beheben?
Die Fehlermeldung "Error 404 - Seite nicht gefunden" bedeutet, dass der Server die angeforderte Seite nicht finden kann. Dies kann auf eine falsche URL, gelöschte Seite oder fehlerhafte Verlinkung zurückzuführen sein. Um den Fehler zu beheben, überprüfe die URL, aktualisiere die Verlinkungen und sorge dafür, dass die Seite korrekt hochgeladen ist. **
-
Was bedeutet die Fehlermeldung "Error 404 - Seite nicht gefunden" und wie kann ich das Problem lösen?
Die Fehlermeldung "Error 404 - Seite nicht gefunden" bedeutet, dass der Server die angeforderte Seite nicht finden kann. Dies kann auf eine falsche URL, gelöschte Seite oder Serverprobleme zurückzuführen sein. Um das Problem zu lösen, überprüfen Sie die URL auf Tippfehler, aktualisieren Sie die Seite oder kontaktieren Sie den Website-Betreiber, um zu überprüfen, ob die Seite noch existiert. **
-
Was bedeutet die Fehlermeldung "CSS-Datei nicht gefunden 404"?
Die Fehlermeldung "CSS-Datei nicht gefunden 404" bedeutet, dass der Webbrowser die angeforderte CSS-Datei nicht auf dem Server finden kann. Dies kann verschiedene Gründe haben, wie zum Beispiel einen falschen Dateipfad oder eine gelöschte oder verschobene Datei. Die CSS-Datei ist wichtig für das Styling und das Aussehen einer Webseite, daher kann das Fehlen dieser Datei zu einer fehlerhaften Darstellung der Webseite führen. **
-
Was bedeutet die Fehlermeldung 'fatal error: stddef.h: Datei oder Verzeichnis nicht gefunden'?
Die Fehlermeldung 'fatal error: stddef.h: Datei oder Verzeichnis nicht gefunden' bedeutet, dass der Compiler die Header-Datei stddef.h nicht finden kann. Diese Datei ist Teil der Standardbibliothek und wird normalerweise benötigt, um grundlegende Datentypen und Funktionen zu definieren. Möglicherweise ist die Datei nicht im richtigen Verzeichnis oder es gibt ein Problem mit den Pfaden in den Compiler-Einstellungen. Es ist wichtig, sicherzustellen, dass die Datei vorhanden ist und korrekt referenziert wird, um diesen Fehler zu beheben. **
Ähnliche Suchbegriffe für 3M-FT-30-Fit-Test
-
3M FT-12 Fit Test Lösung, Nachfüllflaschen a 55ml, Süss (Pack=6Stück)Bei der 3M Fit Test Lösung FT12 handelt es sich um ein Masken- und Kontrollzubehör von 3M. Die Fit Test Lösung in der Nachfüllflasche wird für den 3M Fit Test FT10 zur qualitativen Dichtsitzprüfung fü...188,17 €*Versand: 0,00 €Sichere Weiterleitung zum Anbieter
-
3M FT-32 Fit Test Lösung, Nachfüllflaschen a 55ml, bitter (Pack=6Stück)Bei der 3M Sensitivity Test Lösung FT32 handelt es sich um ein Masken- und Kontrollzubehör von 3M. Die Sensitivity Test Lösung in der Nachfüllflasche wird für den 3M Fit Test FT30 zur qualitativen Dic...188,17 €*Versand: 0,00 €Sichere Weiterleitung zum Anbieter
-
3M FT-11 Fit Test Sensitivity Lösung, Flaschen a 55ml, süss (Pack=6Stück)Bei der 3M Sensitivity Test Lösung FT11 handelt es sich um ein Masken- und Kontrollzubehör von 3M. Die Sensitivity Test Lösung in der Nachfüllflasche wird für den 3M Fit Test FT10 zur qualitativen Dic...188,17 €*Versand: 0,00 €Sichere Weiterleitung zum Anbieter
-
3M FT-31 Fit Test Sensitivity Lösung, Flaschen a 55ml, bitter (Pack=6Stück)Die 3M Empfindlichkeitslösung FT-31 wird verwendet, um die Empfindlichkeit des Trägers des Atemschutzes gegenüber einer bitteren Lösung zu testen. Sie wird zusammen mit dem 3M Apparat zur qualitativen...188,17 €*Versand: 0,00 €Sichere Weiterleitung zum Anbieter
-
Was bedeutet die Fehlermeldung "Fatal error: Uncaught PDOException: SQLSTATE[42S22]: Spalte nicht gefunden: 1054 Unbekannte Spalte 'test' im 'where'-Klausel in C:\xampp\htdocs\shop\meinangemeldet.php?".
Die Fehlermeldung "Fatal error: Uncaught PDOException: SQLSTATE[42S22]: Spalte nicht gefunden: 1054 Unbekannte Spalte 'test' im 'where'-Klausel in C:\xampp\htdocs\shop\meinangemeldet.php" bedeutet, dass in der SQL-Abfrage eine Spalte namens 'test' verwendet wird, die in der Datenbanktabelle nicht existiert. Dadurch kann die Abfrage nicht ausgeführt werden, da die angegebene Spalte nicht gefunden werden kann. Möglicherweise wurde ein Tippfehler gemacht oder die Spalte wurde umbenannt oder gelöscht. Es ist wichtig, die SQL-Abfrage zu überprüfen und sicherzustellen, dass alle Spalten korrekt benannt sind und in der Datenbank vorhanden sind. **
-
Wie viel Erde befindet sich in einem Loch mit den Maßen 3m x 3m x 3m?
In einem Loch mit den Maßen 3m x 3m x 3m befindet sich keine Erde, da es sich um ein Loch handelt, das ausgegraben wurde und somit die Erde entfernt wurde. **
-
Warum erscheint die Fehlermeldung "404 Not Found"?
Die Fehlermeldung "404 Not Found" erscheint, wenn der Server keine Ressource unter der angegebenen URL finden kann. Dies kann verschiedene Gründe haben, wie zum Beispiel eine falsch geschriebene URL, eine gelöschte oder verschobene Datei oder ein Problem mit den Servereinstellungen. In jedem Fall bedeutet die Fehlermeldung, dass die angeforderte Seite nicht verfügbar ist. **
-
Was bedeutet die Fehlermeldung "Error 1275"?
Die Fehlermeldung "Error 1275" deutet in der Regel darauf hin, dass ein Programm oder eine Anwendung nicht mit Administratorrechten ausgeführt wird. Um den Fehler zu beheben, sollte das Programm mit Administratorrechten gestartet werden. **
* Alle Preise verstehen sich inklusive der gesetzlichen Mehrwertsteuer und ggf. zuzüglich Versandkosten. Die Angebotsinformationen basieren auf den Angaben des jeweiligen Shops und werden über automatisierte Prozesse aktualisiert. Eine Aktualisierung in Echtzeit findet nicht statt, so dass es im Einzelfall zu Abweichungen kommen kann. ** Hinweis: Teile dieses Inhalts wurden von KI erstellt.